Target
Heat shock protein HSP 90-alpha
Ligand
BDBM47935
Substrate
Meas. Tech.
Luminescence-based dose response biochemical high throughput screening assay for inhibitors of the Heat Shock Protein 90 (HSP90)
IC50
728.49±n/a nM
Citation
 PubChem, PC Luminescence-based dose response biochemical high throughput screening assay for inhibitors of the Heat Shock Protein 90 (HSP90) PubChem Bioassay (2009)[AID] 
Target
Name:
Heat shock protein HSP 90-alpha
Synonyms:
HS90A_HUMAN HSP86 HSP90AA1 HSPCA Heat shock 86 kDa Heat shock protein HSP 90-alpha (HSP90) LAP-2 Lipopolysaccharide-associated protein 2 heat shock protein 90kDa alpha (cytosolic), class A member 1 isoform 2
Type:
Molecular Chaperone
Mol. Mass.:
84623.45
Organism:
Homo sapiens (Human)
Description:
P07900
Residue:
732
  
Inhibitor
Name:
BDBM47935
Synonyms:
MLS000106202 N-[2-(4-bromophenyl)-6-methyl-pyrimidin-4-yl]hydroxylamine SMR000103171 | cid_755301
Type:
Small organic molecule
Emp. Form.:
C11H10BrN3O
Mol. Mass.:
280.121
SMILES:
Cc1cc(NO)nc(n1)-c1ccc(Br)cc1
: