Target
Heat shock protein HSP 90-alpha
Ligand
BDBM47936
Substrate
Meas. Tech.
Luminescence-based dose response biochemical high throughput screening assay for inhibitors of the Heat Shock Protein 90 (HSP90)
IC50
6547±n/a nM
Citation
 PubChem, PC Luminescence-based dose response biochemical high throughput screening assay for inhibitors of the Heat Shock Protein 90 (HSP90) PubChem Bioassay (2009)[AID] 
Target
Name:
Heat shock protein HSP 90-alpha
Synonyms:
HS90A_HUMAN HSP86 HSP90AA1 HSPCA Heat shock 86 kDa Heat shock protein HSP 90-alpha (HSP90) LAP-2 Lipopolysaccharide-associated protein 2 heat shock protein 90kDa alpha (cytosolic), class A member 1 isoform 2
Type:
Molecular Chaperone
Mol. Mass.:
84623.45
Organism:
Homo sapiens (Human)
Description:
P07900
Residue:
732
  
Inhibitor
Name:
BDBM47936
Synonyms:
4-methyl-2-[(5-methyl-2-furoyl)amino]thiazole-5-carboxylic acid ethyl ester MLS000107953 cid_868243 ethyl 4-methyl-2-[(5-methylfuran-2-yl)carbonylamino]-1,3-thiazole-5-carboxylate
Type:
Small organic molecule
Emp. Form.:
C13H14N2O4S
Mol. Mass.:
294.326
SMILES:
CCOC(=O)c1sc(NC(=O)c2ccc(C)o2)nc1C
: