Target
Heat shock protein HSP 90-alpha
Ligand
BDBM47937
Substrate
Meas. Tech.
Luminescence-based dose response biochemical high throughput screening assay for inhibitors of the Heat Shock Protein 90 (HSP90)
IC50
1072±n/a nM
Citation
 PubChem, PC Luminescence-based dose response biochemical high throughput screening assay for inhibitors of the Heat Shock Protein 90 (HSP90) PubChem Bioassay (2009)[AID] 
Target
Name:
Heat shock protein HSP 90-alpha
Synonyms:
HS90A_HUMAN HSP86 HSP90AA1 HSPCA Heat shock 86 kDa Heat shock protein HSP 90-alpha (HSP90) LAP-2 Lipopolysaccharide-associated protein 2 heat shock protein 90kDa alpha (cytosolic), class A member 1 isoform 2
Type:
Molecular Chaperone
Mol. Mass.:
84623.45
Organism:
Homo sapiens (Human)
Description:
P07900
Residue:
732
  
Inhibitor
Name:
BDBM47937
Synonyms:
5-[(2-keto-3,4-dimethyl-chromen-7-yl)oxymethyl]furan-2-carboxylic acid methyl ester MLS000112297 cid_751241 methyl 5-[(3,4-dimethyl-2-oxochromen-7-yl)oxymethyl]furan-2-carboxylate
Type:
Small organic molecule
Emp. Form.:
C18H16O6
Mol. Mass.:
328.316
SMILES:
COC(=O)c1ccc(COc2ccc3c(C)c(C)c(=O)oc3c2)o1
: