Target
Heat shock protein HSP 90-alpha
Ligand
BDBM47960
Substrate
Meas. Tech.
Luminescence-based dose response biochemical high throughput screening assay for inhibitors of the Heat Shock Protein 90 (HSP90)
IC50
235.15±n/a nM
Citation
 PubChem, PC Luminescence-based dose response biochemical high throughput screening assay for inhibitors of the Heat Shock Protein 90 (HSP90) PubChem Bioassay (2009)[AID] 
Target
Name:
Heat shock protein HSP 90-alpha
Synonyms:
HS90A_HUMAN HSP86 HSP90AA1 HSPCA Heat shock 86 kDa Heat shock protein HSP 90-alpha (HSP90) LAP-2 Lipopolysaccharide-associated protein 2 heat shock protein 90kDa alpha (cytosolic), class A member 1 isoform 2
Type:
Molecular Chaperone
Mol. Mass.:
84623.45
Organism:
Homo sapiens (Human)
Description:
P07900
Residue:
732
  
Inhibitor
Name:
BDBM47960
Synonyms:
MLS000732969 N-methyl-N-[[5-methyl-2-(4-phenylphenyl)-1,3-oxazol-4-yl]methyl]oxolan-3-amine SMR000316222 methyl-[[5-methyl-2-(4-phenylphenyl)oxazol-4-yl]methyl]-tetrahydrofuran-3-yl-amine
Type:
Small organic molecule
Emp. Form.:
C22H24N2O2
Mol. Mass.:
348.4382
SMILES:
CN(Cc1nc(oc1C)-c1ccc(cc1)-c1ccccc1)C1CCOC1
: