Target
Heat shock protein HSP 90-alpha
Ligand
BDBM47966
Substrate
Meas. Tech.
Luminescence-based dose response biochemical high throughput screening assay for inhibitors of the Heat Shock Protein 90 (HSP90)
IC50
469.18±n/a nM
Citation
 PubChem, PC Luminescence-based dose response biochemical high throughput screening assay for inhibitors of the Heat Shock Protein 90 (HSP90) PubChem Bioassay (2009)[AID] 
Target
Name:
Heat shock protein HSP 90-alpha
Synonyms:
HS90A_HUMAN HSP86 HSP90AA1 HSPCA Heat shock 86 kDa Heat shock protein HSP 90-alpha (HSP90) LAP-2 Lipopolysaccharide-associated protein 2 heat shock protein 90kDa alpha (cytosolic), class A member 1 isoform 2
Type:
Molecular Chaperone
Mol. Mass.:
84623.45
Organism:
Homo sapiens (Human)
Description:
P07900
Residue:
732
  
Inhibitor
Name:
BDBM47966
Synonyms:
4-(4-tert-butylbenzoyl)-1H-pyrrole-2-carboxylic acid 4-[(4-tert-butylphenyl)-oxomethyl]-1H-pyrrole-2-carboxylic acid MLS000736350 cid_1485146
Type:
Small organic molecule
Emp. Form.:
C16H17NO3
Mol. Mass.:
271.3111
SMILES:
CC(C)(C)c1ccc(cc1)C(=O)c1c[nH]c(c1)C(O)=O
: