Target
Heat shock protein HSP 90-alpha
Ligand
BDBM47974
Substrate
Meas. Tech.
Luminescence-based dose response biochemical high throughput screening assay for inhibitors of the Heat Shock Protein 90 (HSP90)
IC50
11403±n/a nM
Citation
 PubChem, PC Luminescence-based dose response biochemical high throughput screening assay for inhibitors of the Heat Shock Protein 90 (HSP90) PubChem Bioassay (2009)[AID] 
Target
Name:
Heat shock protein HSP 90-alpha
Synonyms:
HS90A_HUMAN HSP86 HSP90AA1 HSPCA Heat shock 86 kDa Heat shock protein HSP 90-alpha (HSP90) LAP-2 Lipopolysaccharide-associated protein 2 heat shock protein 90kDa alpha (cytosolic), class A member 1 isoform 2
Type:
Molecular Chaperone
Mol. Mass.:
84623.45
Organism:
Homo sapiens (Human)
Description:
P07900
Residue:
732
  
Inhibitor
Name:
BDBM47974
Synonyms:
3-[2-[1-(1-methoxypropan-2-yl)-2,5-dimethyl-3-pyrrolyl]-2-oxoethyl]-4-oxo-1-phthalazinecarboxylic acid 3-[2-[1-(1-methoxypropan-2-yl)-2,5-dimethylpyrrol-3-yl]-2-oxoethyl]-4-oxophthalazine-1-carboxylic acid MLS000774234 cid_3428733
Type:
Small organic molecule
Emp. Form.:
C21H23N3O5
Mol. Mass.:
397.4244
SMILES:
COCC(C)n1c(C)cc(C(=O)Cn2nc(C(O)=O)c3ccccc3c2=O)c1C
: