Target
Heat shock protein HSP 90-alpha
Ligand
BDBM47983
Substrate
Meas. Tech.
Luminescence-based dose response biochemical high throughput screening assay for inhibitors of the Heat Shock Protein 90 (HSP90)
IC50
>7000±n/a nM
Citation
 PubChem, PC Luminescence-based dose response biochemical high throughput screening assay for inhibitors of the Heat Shock Protein 90 (HSP90) PubChem Bioassay (2009)[AID] 
Target
Name:
Heat shock protein HSP 90-alpha
Synonyms:
HS90A_HUMAN HSP86 HSP90AA1 HSPCA Heat shock 86 kDa Heat shock protein HSP 90-alpha (HSP90) LAP-2 Lipopolysaccharide-associated protein 2 heat shock protein 90kDa alpha (cytosolic), class A member 1 isoform 2
Type:
Molecular Chaperone
Mol. Mass.:
84623.45
Organism:
Homo sapiens (Human)
Description:
P07900
Residue:
732
  
Inhibitor
Name:
BDBM47983
Synonyms:
5-(2,3-dihydro-1H-inden-5-yloxymethyl)-2-furancarboxylic acid methyl ester 5-(indan-5-yloxymethyl)furan-2-carboxylic acid methyl ester SMR000431238 methyl 5-(2,3-dihydro-1H-inden-5-yloxymethyl)furan-2-carboxylate
Type:
Small organic molecule
Emp. Form.:
C16H16O4
Mol. Mass.:
272.2958
SMILES:
COC(=O)c1ccc(COc2ccc3CCCc3c2)o1
: