Target
Heat shock protein HSP 90-alpha
Ligand
BDBM48000
Substrate
Meas. Tech.
Luminescence-based dose response biochemical high throughput screening assay for inhibitors of the Heat Shock Protein 90 (HSP90)
IC50
2785±n/a nM
Citation
 PubChem, PC Luminescence-based dose response biochemical high throughput screening assay for inhibitors of the Heat Shock Protein 90 (HSP90) PubChem Bioassay (2009)[AID] 
Target
Name:
Heat shock protein HSP 90-alpha
Synonyms:
HS90A_HUMAN HSP86 HSP90AA1 HSPCA Heat shock 86 kDa Heat shock protein HSP 90-alpha (HSP90) LAP-2 Lipopolysaccharide-associated protein 2 heat shock protein 90kDa alpha (cytosolic), class A member 1 isoform 2
Type:
Molecular Chaperone
Mol. Mass.:
84623.45
Organism:
Homo sapiens (Human)
Description:
P07900
Residue:
732
  
Inhibitor
Name:
BDBM48000
Synonyms:
(4Z)-4-[(N-hydroxyanilino)methylene]-5-methyl-2-phenyl-2-pyrazolin-3-one (4Z)-4-[(N-hydroxyanilino)methylidene]-5-methyl-2-phenylpyrazol-3-one 4-{[hydroxy(phenyl)amino]methylene}-5-methyl-2-phenyl-2,4-dihydro-3H-pyrazol-3-one SMR000496695 | cid_2861782
Type:
Small organic molecule
Emp. Form.:
C17H15N3O2
Mol. Mass.:
293.3199
SMILES:
ON(C=c1c(=C)[nH]n(-c2ccccc2)c1=O)c1ccccc1
: