Target
Heat shock protein HSP 90-alpha
Ligand
BDBM48008
Substrate
Meas. Tech.
Luminescence-based dose response biochemical high throughput screening assay for inhibitors of the Heat Shock Protein 90 (HSP90)
IC50
3286±n/a nM
Citation
 PubChem, PC Luminescence-based dose response biochemical high throughput screening assay for inhibitors of the Heat Shock Protein 90 (HSP90) PubChem Bioassay (2009)[AID] 
Target
Name:
Heat shock protein HSP 90-alpha
Synonyms:
HS90A_HUMAN HSP86 HSP90AA1 HSPCA Heat shock 86 kDa Heat shock protein HSP 90-alpha (HSP90) LAP-2 Lipopolysaccharide-associated protein 2 heat shock protein 90kDa alpha (cytosolic), class A member 1 isoform 2
Type:
Molecular Chaperone
Mol. Mass.:
84623.45
Organism:
Homo sapiens (Human)
Description:
P07900
Residue:
732
  
Inhibitor
Name:
BDBM48008
Synonyms:
MLS001215892 [2-[3-[(E)-2-(4-methoxyphenyl)ethenyl]-1,2,4-oxadiazol-5-yl]phenyl] acetate acetic acid [2-[3-[(E)-2-(4-methoxyphenyl)ethenyl]-1,2,4-oxadiazol-5-yl]phenyl] ester cid_8034425
Type:
Small organic molecule
Emp. Form.:
C19H16N2O4
Mol. Mass.:
336.3413
SMILES:
COc1ccc(\C=C\c2noc(n2)-c2ccccc2OC(C)=O)cc1
: