Target
Heat shock protein HSP 90-alpha
Ligand
BDBM48015
Substrate
Meas. Tech.
Luminescence-based dose response biochemical high throughput screening assay for inhibitors of the Heat Shock Protein 90 (HSP90)
IC50
1504±n/a nM
Citation
 PubChem, PC Luminescence-based dose response biochemical high throughput screening assay for inhibitors of the Heat Shock Protein 90 (HSP90) PubChem Bioassay (2009)[AID] 
Target
Name:
Heat shock protein HSP 90-alpha
Synonyms:
HS90A_HUMAN HSP86 HSP90AA1 HSPCA Heat shock 86 kDa Heat shock protein HSP 90-alpha (HSP90) LAP-2 Lipopolysaccharide-associated protein 2 heat shock protein 90kDa alpha (cytosolic), class A member 1 isoform 2
Type:
Molecular Chaperone
Mol. Mass.:
84623.45
Organism:
Homo sapiens (Human)
Description:
P07900
Residue:
732
  
Inhibitor
Name:
BDBM48015
Synonyms:
2-chloranyl-5-[2-[[3-methoxy-4-(4-methoxyphenyl)carbonyloxy-phenyl]methylidene]hydrazinyl]benzoic acid 2-chloro-5-[2-[[3-methoxy-4-[(4-methoxyphenyl)-oxomethoxy]phenyl]methylidene]hydrazinyl]benzoic acid MLS001173826 cid_3615873
Type:
Small organic molecule
Emp. Form.:
C23H19ClN2O6
Mol. Mass.:
454.86
SMILES:
COc1ccc(cc1)C(=O)Oc1ccc(CN=Nc2ccc(Cl)c(c2)C(O)=O)cc1OC
: