Target
Heat shock protein HSP 90-alpha
Ligand
BDBM48021
Substrate
Meas. Tech.
Luminescence-based dose response biochemical high throughput screening assay for inhibitors of the Heat Shock Protein 90 (HSP90)
IC50
1314±n/a nM
Citation
 PubChem, PC Luminescence-based dose response biochemical high throughput screening assay for inhibitors of the Heat Shock Protein 90 (HSP90) PubChem Bioassay (2009)[AID] 
Target
Name:
Heat shock protein HSP 90-alpha
Synonyms:
HS90A_HUMAN HSP86 HSP90AA1 HSPCA Heat shock 86 kDa Heat shock protein HSP 90-alpha (HSP90) LAP-2 Lipopolysaccharide-associated protein 2 heat shock protein 90kDa alpha (cytosolic), class A member 1 isoform 2
Type:
Molecular Chaperone
Mol. Mass.:
84623.45
Organism:
Homo sapiens (Human)
Description:
P07900
Residue:
732
  
Inhibitor
Name:
BDBM48021
Synonyms:
(5Z)-5-[(1-prop-2-ynyl-1H-indol-3-yl)methylene]imidazolidine-2,4-dione (5Z)-5-[(1-prop-2-ynylindol-3-yl)methylidene]imidazolidine-2,4-dione MLS001196241 cid_2290403
Type:
Small organic molecule
Emp. Form.:
C15H11N3O2
Mol. Mass.:
265.2667
SMILES:
O=C1NC(=O)\C(N1)=C\c1cn(CC#C)c2ccccc12
: