Target
Muscarinic acetylcholine receptor M4
Ligand
BDBM48078
Substrate
Meas. Tech.
Discovery of a Highly Selective in vitro and in vivo M4 Positive Allosteric Modulator(PAM): Analog Potency
EC50
5810±n/a nM
Citation
 PubChem, PC Discovery of a Highly Selective in vitro and in vivo M4 Positive Allosteric Modulator(PAM): Analog Potency PubChem Bioassay (2010)[AID] 
Target
Name:
Muscarinic acetylcholine receptor M4
Synonyms:
ACM4_RAT Chrm-4 | Chrm4
Type:
Enzyme Catalytic Domain
Mol. Mass.:
52841.70
Organism:
RAT
Description:
Cholinergic, muscarinic M4 CHRM4 RAT::P08485
Residue:
477
  
Inhibitor
Name:
BDBM48078
Synonyms:
3-amino-4-methyl-6-(2-morpholin-4-ylethoxy)-N-phenylthieno[2,3-b]pyridine-2-carboxamide 3-amino-4-methyl-6-[2-(4-morpholinyl)ethoxy]-N-phenyl-2-thieno[2,3-b]pyridinecarboxamide VU0359455 | cid_45142489
Type:
Small organic molecule
Emp. Form.:
C21H24N4O3S
Mol. Mass.:
412.505
SMILES:
Cc1cc(OCCN2CCOCC2)nc2sc(C(=O)Nc3ccccc3)c(N)c12
: