Target
Dual specificity protein phosphatase 3
Ligand
BDBM46209
Substrate
Meas. Tech.
SAR VHR1 absorbance Assay for In Vitro dose response studies.
IC50
12500±n/a nM
Citation
 PubChem, PC SAR VHR1 absorbance Assay for In Vitro dose response studies. PubChem Bioassay (2009)[AID] 
Target
Name:
Dual specificity protein phosphatase 3
Synonyms:
DUS3_HUMAN Dual specificity protein phosphatase (VHR) Dual specificity protein phosphatase VHR Tyrosine-protein phosphatase non-receptor type 1 | VHR
Type:
Hydrolase
Mol. Mass.:
20480.58
Organism:
Homo sapiens (Human)
Description:
Residue:
185
  
Inhibitor
Name:
BDBM46209
Synonyms:
1-cyclopropyl-3-(4-sulfamoylphenyl)thiourea cid_891589
Type:
Small organic molecule
Emp. Form.:
C10H13N3O2S2
Mol. Mass.:
271.359
SMILES:
NS(=O)(=O)c1ccc(NC(=S)NC2CC2)cc1
: