Target
Dual specificity protein phosphatase 3
Ligand
BDBM46229
Substrate
Meas. Tech.
SAR VHR1 absorbance Assay for In Vitro dose response studies.
IC50
121±n/a nM
Citation
 PubChem, PC SAR VHR1 absorbance Assay for In Vitro dose response studies. PubChem Bioassay (2009)[AID] 
Target
Name:
Dual specificity protein phosphatase 3
Synonyms:
DUS3_HUMAN Dual specificity protein phosphatase (VHR) Dual specificity protein phosphatase VHR Tyrosine-protein phosphatase non-receptor type 1 | VHR
Type:
Hydrolase
Mol. Mass.:
20480.58
Organism:
Homo sapiens (Human)
Description:
Residue:
185
  
Inhibitor
Name:
BDBM46229
Synonyms:
4-chloranyl-N-(3,4-dihydro-2H-thiochromen-4-yl)-3-sulfamoyl-benzamide 4-chloro-N-(3,4-dihydro-2H-1-benzothiopyran-4-yl)-3-sulfamoylbenzamide MLS-0336143.0001 | cid_16330874
Type:
Small organic molecule
Emp. Form.:
C16H15ClN2O3S2
Mol. Mass.:
382.885
SMILES:
NS(=O)(=O)c1cc(ccc1Cl)C(=O)NC1CCSc2ccccc12
: