Target
Dual specificity protein phosphatase 3
Ligand
BDBM46249
Substrate
Meas. Tech.
SAR VHR1 absorbance Assay for In Vitro dose response studies.
IC50
>100000±n/a nM
Citation
 PubChem, PC SAR VHR1 absorbance Assay for In Vitro dose response studies. PubChem Bioassay (2009)[AID] 
Target
Name:
Dual specificity protein phosphatase 3
Synonyms:
DUS3_HUMAN Dual specificity protein phosphatase (VHR) Dual specificity protein phosphatase VHR Tyrosine-protein phosphatase non-receptor type 1 | VHR
Type:
Hydrolase
Mol. Mass.:
20480.58
Organism:
Homo sapiens (Human)
Description:
Residue:
185
  
Inhibitor
Name:
BDBM46249
Synonyms:
(4E)-4-[(cyclohexylamino)-mercapto-methylene]-2-methoxy-cyclohexa-2,5-dien-1-one (4E)-4-[(cyclohexylamino)-sulfanyl-methylidene]-2-methoxy-cyclohexa-2,5-dien-1-one MLS-0412117.0001 | cid_5504142
Type:
Small organic molecule
Emp. Form.:
C14H19NO2S
Mol. Mass.:
265.371
SMILES:
COc1cc(ccc1O)C(=S)NC1CCCCC1
: