Target
Dual specificity protein phosphatase 3
Ligand
BDBM46260
Substrate
Meas. Tech.
SAR VHR1 absorbance Assay for In Vitro dose response studies.
IC50
72500±n/a nM
Citation
 PubChem, PC SAR VHR1 absorbance Assay for In Vitro dose response studies. PubChem Bioassay (2009)[AID] 
Target
Name:
Dual specificity protein phosphatase 3
Synonyms:
DUS3_HUMAN Dual specificity protein phosphatase (VHR) Dual specificity protein phosphatase VHR Tyrosine-protein phosphatase non-receptor type 1 | VHR
Type:
Hydrolase
Mol. Mass.:
20480.58
Organism:
Homo sapiens (Human)
Description:
Residue:
185
  
Inhibitor
Name:
BDBM46260
Synonyms:
MLS-0412135.0001 N,N-diethyl-1-(2-phenoxyethyl)indole-3-carboxamide | cid_44182141
Type:
Small organic molecule
Emp. Form.:
C21H24N2O2
Mol. Mass.:
336.4275
SMILES:
CCN(CC)C(=O)c1cn(CCOc2ccccc2)c2ccccc12
: