Target
Beta-galactosidase
Ligand
BDBM48082
Substrate
Meas. Tech.
HTS Dose response counterscreen for assays utilizing the enzyme, b-galactosidase
EC50
23850±n/a nM
Citation
 PubChem, PC HTS Dose response counterscreen for assays utilizing the enzyme, b-galactosidase PubChem Bioassay (2009)[AID] 
Target
Name:
Beta-galactosidase
Synonyms:
BGAL_ECOLX Lactase | lacZ
Type:
PROTEIN
Mol. Mass.:
116943.87
Organism:
Escherichia coli
Description:
ChEMBL_215882
Residue:
1029
  
Inhibitor
Name:
BDBM48082
Synonyms:
(4,5-Diphenyl-1H-imidazol-2-yl)-(2-methoxy-phenyl)-diazene N-[(4,5-diphenyl-2-imidazolylidene)amino]-2-methoxyaniline N-[(4,5-diphenylimidazol-2-ylidene)amino]-2-methoxyaniline [(4,5-diphenylimidazol-2-ylidene)amino]-(2-methoxyphenyl)amine | cid_5335910
Type:
Small organic molecule
Emp. Form.:
C22H18N4O
Mol. Mass.:
354.4045
SMILES:
COc1ccccc1N=Nc1nc(c([nH]1)-c1ccccc1)-c1ccccc1
: