Target
Estrogen receptor beta
Ligand
BDBM48424
Substrate
Meas. Tech.
Estrogen Receptor-beta Coactivator Binding Inhibitors Dose Response Confirmation
IC50
3200.05±n/a nM
Citation
 PubChem, PC Estrogen Receptor-beta Coactivator Binding Inhibitors Dose Response Confirmation PubChem Bioassay (2007)[AID] 
Target
Name:
Estrogen receptor beta
Synonyms:
ER-beta ESR2_HUMAN Estradiol receptor beta (ERβ) Estrogen receptor (ER beta) Estrogen receptor beta (ER beta) NR3A2 estrogen beta
Type:
Protein
Mol. Mass.:
59238.43
Organism:
Homo sapiens (Human)
Description:
Q92731
Residue:
530
  
Inhibitor
Name:
BDBM48424
Synonyms:
MLS000111651 N-(4-hydroxyphenyl)cyclohex-3-ene-1-carboxamide cid_3133530
Type:
Small organic molecule
Emp. Form.:
C13H15NO2
Mol. Mass.:
217.2637
SMILES:
Oc1ccc(NC(=O)C2CCC=CC2)cc1
: