Target
Estrogen receptor beta
Ligand
BDBM40315
Substrate
Meas. Tech.
Estrogen Receptor-beta Coactivator Binding Inhibitors Dose Response Confirmation
IC50
2611.21±n/a nM
Citation
 PubChem, PC Estrogen Receptor-beta Coactivator Binding Inhibitors Dose Response Confirmation PubChem Bioassay (2007)[AID] 
Target
Name:
Estrogen receptor beta
Synonyms:
ER-beta ESR2_HUMAN Estradiol receptor beta (ERβ) Estrogen receptor (ER beta) Estrogen receptor beta (ER beta) NR3A2 estrogen beta
Type:
Protein
Mol. Mass.:
59238.43
Organism:
Homo sapiens (Human)
Description:
Q92731
Residue:
530
  
Inhibitor
Name:
BDBM40315
Synonyms:
MLS000526075 N-[4-[6-(thiophen-2-ylcarbonylamino)-1H-benzimidazol-2-yl]phenyl]thiophene-2-carboxamide N-[4-[6-[[oxo(thiophen-2-yl)methyl]amino]-1H-benzimidazol-2-yl]phenyl]-2-thiophenecarboxamide cid_1160447
Type:
Small organic molecule
Emp. Form.:
C23H16N4O2S2
Mol. Mass.:
444.529
SMILES:
O=C(Nc1ccc(cc1)-c1nc2ccc(NC(=O)c3cccs3)cc2[nH]1)c1cccs1
: