Target
Estrogen receptor beta
Ligand
BDBM40159
Substrate
Meas. Tech.
Estrogen Receptor-beta Coactivator Binding Inhibitors Dose Response Confirmation
IC50
2324.07±n/a nM
Citation
 PubChem, PC Estrogen Receptor-beta Coactivator Binding Inhibitors Dose Response Confirmation PubChem Bioassay (2007)[AID] 
Target
Name:
Estrogen receptor beta
Synonyms:
ER-beta ESR2_HUMAN Estradiol receptor beta (ERβ) Estrogen receptor (ER beta) Estrogen receptor beta (ER beta) NR3A2 estrogen beta
Type:
Protein
Mol. Mass.:
59238.43
Organism:
Homo sapiens (Human)
Description:
Q92731
Residue:
530
  
Inhibitor
Name:
BDBM40159
Synonyms:
5-(4-Nitro-pyrazol-1-ylmethyl)-furan-2-carboxylic acid (3-cyano-6-methyl-4,5,6,7-tetrahydro-benzo[b]thiophen-2-yl)-amide N-(3-cyano-6-methyl-4,5,6,7-tetrahydro-1-benzothiophen-2-yl)-5-[(4-nitro-1-pyrazolyl)methyl]-2-furancarboxamide N-(3-cyano-6-methyl-4,5,6,7-tetrahydrobenzothiophen-2-yl)-5-[(4-nitropyrazol-1-yl)methyl]-2-furamide cid_3153921
Type:
Small organic molecule
Emp. Form.:
C19H17N5O4S
Mol. Mass.:
411.434
SMILES:
CC1CCc2c(C1)sc(NC(=O)c1ccc(Cn3cc(cn3)[N+]([O-])=O)o1)c2C#N
: