Target
Eukaryotic translation initiation factor 4 gamma 1
Ligand
BDBM29615
Substrate
Meas. Tech.
Dose Response Confirmation for Small Molecule Inhibitors of Eukaryotic Translation Initiation
IC50
12809.76587±n/a nM
Citation
 PubChem, PC Dose Response Confirmation for Small Molecule Inhibitors of Eukaryotic Translation Initiation PubChem Bioassay (2009)[AID] 
Target
Name:
Eukaryotic translation initiation factor 4 gamma 1
Synonyms:
EIF4F EIF4G1 IF4G1_HUMAN | eukaryotic translation initiation factor 4 gamma, 1 isoform 4
Type:
Enzyme Catalytic Domain
Mol. Mass.:
175455.17
Organism:
Homo sapiens (Human)
Description:
Q04637
Residue:
1599
  
Inhibitor
Name:
BDBM29615
Synonyms:
6-methoxy-3a,4,5,9b-tetrahydro-3H-cyclopenta[c]quinoline-4-carboxylic acid SMR000009698 cid_652912
Type:
Small organic molecule
Emp. Form.:
C14H15NO3
Mol. Mass.:
245.2738
SMILES:
COc1cccc2C3C=CCC3C(Nc12)C(O)=O
: