Target
Eukaryotic translation initiation factor 4 gamma 1
Ligand
BDBM38601
Substrate
Meas. Tech.
Dose Response Confirmation for Small Molecule Inhibitors of Eukaryotic Translation Initiation
IC50
9593.36532±n/a nM
Citation
 PubChem, PC Dose Response Confirmation for Small Molecule Inhibitors of Eukaryotic Translation Initiation PubChem Bioassay (2009)[AID] 
Target
Name:
Eukaryotic translation initiation factor 4 gamma 1
Synonyms:
EIF4F EIF4G1 IF4G1_HUMAN | eukaryotic translation initiation factor 4 gamma, 1 isoform 4
Type:
Enzyme Catalytic Domain
Mol. Mass.:
175455.17
Organism:
Homo sapiens (Human)
Description:
Q04637
Residue:
1599
  
Inhibitor
Name:
BDBM38601
Synonyms:
7-(3,4-dimethylanilino)-6-(2-methylphenyl)-7H-pyrrolo[3,4-b]pyridin-5-one 7-[(3,4-dimethylphenyl)amino]-6-(2-methylphenyl)-6,7-dihydro-5H-pyrrolo[3,4-b]pyridin-5-one MLS000045804 cid_3240143
Type:
Small organic molecule
Emp. Form.:
C22H21N3O
Mol. Mass.:
343.4216
SMILES:
Cc1ccc(Nc2n(-c3ccccc3C)c(=O)c3ccc[nH]c23)cc1C
: