Target
Eukaryotic translation initiation factor 4 gamma 1
Ligand
BDBM31748
Substrate
Meas. Tech.
Dose Response Confirmation for Small Molecule Inhibitors of Eukaryotic Translation Initiation
IC50
5210±n/a nM
Citation
 PubChem, PC Dose Response Confirmation for Small Molecule Inhibitors of Eukaryotic Translation Initiation PubChem Bioassay (2009)[AID] 
Target
Name:
Eukaryotic translation initiation factor 4 gamma 1
Synonyms:
EIF4F EIF4G1 IF4G1_HUMAN | eukaryotic translation initiation factor 4 gamma, 1 isoform 4
Type:
Enzyme Catalytic Domain
Mol. Mass.:
175455.17
Organism:
Homo sapiens (Human)
Description:
Q04637
Residue:
1599
  
Inhibitor
Name:
BDBM31748
Synonyms:
8-chloranyl-9-nitro-6-oxidanyl-3a,4,5,9b-tetrahydro-3H-cyclopenta[c]quinoline-4-carboxylic acid MLS-0111541.0001 cid_3453217
Type:
Small organic molecule
Emp. Form.:
C13H11ClN2O5
Mol. Mass.:
310.69
SMILES:
OC(=O)C1Nc2c(O)cc(Cl)c(c2C2C=CCC12)[N+]([O-])=O
: