Target
D(1B) dopamine receptor
Ligand
BDBM48917
Substrate
Meas. Tech.
Allosteric Modulators of D1 Receptors: Dose-dependent Counterscreen
EC50
0.00173±n/a nM
Citation
 PubChem, PC Allosteric Modulators of D1 Receptors: Dose-dependent Counterscreen PubChem Bioassay (2007)[AID] 
Target
Name:
D(1B) dopamine receptor
Synonyms:
D(5) dopamine receptor DOPAMINE D5 DRD1L2 DRD5_HUMAN | dopamine receptor D5
Type:
Protein
Mol. Mass.:
52943.41
Organism:
Homo sapiens (Human)
Description:
P21918
Residue:
477
  
Inhibitor
Name:
BDBM48917
Synonyms:
1-phenyl-2-[[1-(phenylmethyl)-1,2,3,4-tetrazol-5-yl]sulfanyl]ethanone 2-(1-Benzyl-1H-tetrazol-5-ylsulfanyl)-1-phenyl-ethanone 2-[(1-benzyltetrazol-5-yl)thio]-1-phenyl-ethanone SMR000000898 | cid_656235
Type:
Small organic molecule
Emp. Form.:
C16H14N4OS
Mol. Mass.:
310.374
SMILES:
O=C(CSc1nnnn1Cc1ccccc1)c1ccccc1
: