Target
D(1B) dopamine receptor
Ligand
BDBM48939
Substrate
Meas. Tech.
Allosteric Modulators of D1 Receptors: Dose-dependent Counterscreen
EC50
0.017±n/a nM
Citation
 PubChem, PC Allosteric Modulators of D1 Receptors: Dose-dependent Counterscreen PubChem Bioassay (2007)[AID] 
Target
Name:
D(1B) dopamine receptor
Synonyms:
D(5) dopamine receptor DOPAMINE D5 DRD1L2 DRD5_HUMAN | dopamine receptor D5
Type:
Protein
Mol. Mass.:
52943.41
Organism:
Homo sapiens (Human)
Description:
P21918
Residue:
477
  
Inhibitor
Name:
BDBM48939
Synonyms:
4-(4-chlorophenyl)-4,10-dihydro-[1,3,5]triazino[1,2-a]benzimidazol-2-amine SMR000091539 cid_5742567
Type:
Small organic molecule
Emp. Form.:
C15H12ClN5
Mol. Mass.:
297.742
SMILES:
NC1=NC(c2ccc(Cl)cc2)n2c(N1)nc1ccccc21
: