Target
D(1B) dopamine receptor
Ligand
BDBM48944
Substrate
Meas. Tech.
Allosteric Modulators of D1 Receptors: Dose-dependent Counterscreen
EC50
0.00712±n/a nM
Citation
 PubChem, PC Allosteric Modulators of D1 Receptors: Dose-dependent Counterscreen PubChem Bioassay (2007)[AID] 
Target
Name:
D(1B) dopamine receptor
Synonyms:
D(5) dopamine receptor DOPAMINE D5 DRD1L2 DRD5_HUMAN | dopamine receptor D5
Type:
Protein
Mol. Mass.:
52943.41
Organism:
Homo sapiens (Human)
Description:
P21918
Residue:
477
  
Inhibitor
Name:
BDBM48944
Synonyms:
1'-{[4-(3-chlorophenyl)piperazin-1-yl]methyl}spiro[1,3-dioxane-2,3'-indol]-2'(1'H)-one 1'-[[4-(3-chlorophenyl)piperazin-1-yl]methyl]spiro[1,3-dioxane-2,3'-indole]-2'-one MLS000046164 cid_3239182
Type:
Small organic molecule
Emp. Form.:
C22H24ClN3O3
Mol. Mass.:
413.897
SMILES:
Clc1cccc(c1)N1CCN(CN2C(=O)C3(OCCCO3)c3ccccc23)CC1
: