Target
D(1B) dopamine receptor
Ligand
BDBM48959
Substrate
Meas. Tech.
Allosteric Modulators of D1 Receptors: Dose-dependent Counterscreen
EC50
0.0699±n/a nM
Citation
 PubChem, PC Allosteric Modulators of D1 Receptors: Dose-dependent Counterscreen PubChem Bioassay (2007)[AID] 
Target
Name:
D(1B) dopamine receptor
Synonyms:
D(5) dopamine receptor DOPAMINE D5 DRD1L2 DRD5_HUMAN | dopamine receptor D5
Type:
Protein
Mol. Mass.:
52943.41
Organism:
Homo sapiens (Human)
Description:
P21918
Residue:
477
  
Inhibitor
Name:
BDBM48959
Synonyms:
9-(2-thienyl)-2,3,8,9-tetrahydro[1,4]dioxino[2,3-g]quinolin-7(6H)-one 9-thiophen-2-yl-3,6,8,9-tetrahydro-2H-[1,4]dioxino[2,3-g]quinolin-7-one SMR000078384 | cid_2962890
Type:
Small organic molecule
Emp. Form.:
C15H13NO3S
Mol. Mass.:
287.334
SMILES:
O=C1CC(c2cccs2)c2cc3OCCOc3cc2N1
: