Target
D(1B) dopamine receptor
Ligand
BDBM48965
Substrate
Meas. Tech.
Allosteric Modulators of D1 Receptors: Dose-dependent Counterscreen
EC50
0.0117±n/a nM
Citation
 PubChem, PC Allosteric Modulators of D1 Receptors: Dose-dependent Counterscreen PubChem Bioassay (2007)[AID] 
Target
Name:
D(1B) dopamine receptor
Synonyms:
D(5) dopamine receptor DOPAMINE D5 DRD1L2 DRD5_HUMAN | dopamine receptor D5
Type:
Protein
Mol. Mass.:
52943.41
Organism:
Homo sapiens (Human)
Description:
P21918
Residue:
477
  
Inhibitor
Name:
BDBM48965
Synonyms:
2-amino-4-(4-pyridyl)thiophene-3-carboxylic acid ethyl ester MLS000061529 cid_874726 ethyl 2-amino-4-pyridin-4-ylthiophene-3-carboxylate | ethyl 2-azanyl-4-pyridin-4-yl-thiophene-3-carboxylate
Type:
Small organic molecule
Emp. Form.:
C12H12N2O2S
Mol. Mass.:
248.301
SMILES:
CCOC(=O)c1c(N)scc1-c1ccncc1
: