Target
D(1A) dopamine receptor
Ligand
BDBM49050
Substrate
Meas. Tech.
Allosteric Modulators of D1 Receptors: Dose-dependent Assay
EC50
0.000313±n/a nM
Citation
 PubChem, PC Allosteric Modulators of D1 Receptors: Dose-dependent Assay PubChem Bioassay (2007)[AID] 
Target
Name:
D(1A) dopamine receptor
Synonyms:
DA D1 receptor DRD1 Dopamine D1 receptor Dopamine D1A
Type:
Enzyme
Mol. Mass.:
49303.43
Organism:
Homo sapiens (Human)
Description:
P21728
Residue:
446
  
Inhibitor
Name:
BDBM49050
Synonyms:
3,4-dimethoxy-N-[5-(2-thenyl)-1,3,4-thiadiazol-2-yl]benzamide 3,4-dimethoxy-N-[5-(thiophen-2-ylmethyl)-1,3,4-thiadiazol-2-yl]benzamide SMR000020967 | cid_1272394
Type:
Small organic molecule
Emp. Form.:
C16H15N3O3S2
Mol. Mass.:
361.439
SMILES:
COc1ccc(cc1OC)C(=O)Nc1nnc(Cc2cccs2)s1
: