Target
D(1A) dopamine receptor
Ligand
BDBM40513
Substrate
Meas. Tech.
Allosteric Modulators of D1 Receptors: Dose-dependent Assay
EC50
0.00249±n/a nM
Citation
 PubChem, PC Allosteric Modulators of D1 Receptors: Dose-dependent Assay PubChem Bioassay (2007)[AID] 
Target
Name:
D(1A) dopamine receptor
Synonyms:
DA D1 receptor DRD1 Dopamine D1 receptor Dopamine D1A
Type:
Enzyme
Mol. Mass.:
49303.43
Organism:
Homo sapiens (Human)
Description:
P21728
Residue:
446
  
Inhibitor
Name:
BDBM40513
Synonyms:
5-[[[1-(4-fluorophenyl)-4-keto-2H-pyrazolo[3,4-d]pyrimidin-6-yl]thio]methyl]furan-2-carboxylic acid methyl ester MLS000044288 cid_2058657 methyl 5-[[1-(4-fluorophenyl)-4-oxo-2H-pyrazolo[3,4-d]pyrimidin-6-yl]sulfanylmethyl]furan-2-carboxylate
Type:
Small organic molecule
Emp. Form.:
C18H13FN4O4S
Mol. Mass.:
400.384
SMILES:
COC(=O)c1ccc(CSc2nc3n(ncc3c(=O)[nH]2)-c2ccc(F)cc2)o1
: