Target
6-phosphofructo-2-kinase/fructose-2,6-bisphosphatase 4
Ligand
BDBM267031
Substrate
Meas. Tech.
PFKFB4 Assay
IC50
900±n/a nM
Citation
 Martinsson, JFaernegardh, KJoensson, MRingom, R Bisarylsulfonamides useful in the treatment of inflammation and cancer US Patent  US9718809 Publication Date 8/1/2017 
Target
Name:
6-phosphofructo-2-kinase/fructose-2,6-bisphosphatase 4
Synonyms:
6-phosphofructo-2-kinase/fructose-2,6-bisphosphatase 4 (PFKFB4) PFKFB4
Type:
Enzyme
Mol. Mass.:
54039.68
Organism:
Homo sapiens (Human)
Description:
Q16877
Residue:
469
  
Inhibitor
Name:
BDBM267031
Synonyms:
4-{[(5-Chloro-4-phenyl-2-thienyl)sulfonyl]amino}-2-hydroxybenzoic acid | US9718809, 27
Type:
Small organic molecule
Emp. Form.:
C17H12ClNO5S2
Mol. Mass.:
409.864
SMILES:
OC(=O)c1ccc(NS(=O)(=O)c2cc(c(Cl)s2)-c2ccccc2)cc1O
: