Target
6-phosphofructo-2-kinase/fructose-2,6-bisphosphatase 4
Ligand
BDBM267071
Substrate
Meas. Tech.
PFKFB4 Assay
IC50
1600±n/a nM
Citation
 Martinsson, JFaernegardh, KJoensson, MRingom, R Bisarylsulfonamides useful in the treatment of inflammation and cancer US Patent  US9718809 Publication Date 8/1/2017 
Target
Name:
6-phosphofructo-2-kinase/fructose-2,6-bisphosphatase 4
Synonyms:
6-phosphofructo-2-kinase/fructose-2,6-bisphosphatase 4 (PFKFB4) PFKFB4
Type:
Enzyme
Mol. Mass.:
54039.68
Organism:
Homo sapiens (Human)
Description:
Q16877
Residue:
469
  
Inhibitor
Name:
BDBM267071
Synonyms:
Methyl 4-[(biphenyl-3-ylsulfonyl)amino]-2-hydroxybenzoate | US9718809, 87
Type:
Small organic molecule
Emp. Form.:
C20H17NO5S
Mol. Mass.:
383.418
SMILES:
COC(=O)c1ccc(NS(=O)(=O)c2cccc(c2)-c2ccccc2)cc1O
: