Target
6-phosphofructo-2-kinase/fructose-2,6-bisphosphatase 4
Ligand
BDBM267074
Substrate
Meas. Tech.
PFKFB4 Assay
IC50
600±n/a nM
Citation
 Martinsson, JFaernegardh, KJoensson, MRingom, R Bisarylsulfonamides useful in the treatment of inflammation and cancer US Patent  US9718809 Publication Date 8/1/2017 
Target
Name:
6-phosphofructo-2-kinase/fructose-2,6-bisphosphatase 4
Synonyms:
6-phosphofructo-2-kinase/fructose-2,6-bisphosphatase 4 (PFKFB4) PFKFB4
Type:
Enzyme
Mol. Mass.:
54039.68
Organism:
Homo sapiens (Human)
Description:
Q16877
Residue:
469
  
Inhibitor
Name:
BDBM267074
Synonyms:
3-Morpholin-4-ylpropyl 4-({[5-chloro-4-(5-fluoro-2-hydroxyphenyl)-2-thienyl]sulfonyl}amino)-2-hydroxybenzoate trifluoroacetate | US9718809, 213
Type:
Small organic molecule
Emp. Form.:
C25H26ClFN2O7S2
Mol. Mass.:
585.065
SMILES:
CC1CN(CCCOC(=O)c2ccc(NS(=O)(=O)c3cc(c(Cl)s3)-c3cc(F)ccc3O)cc2O)CCO1
: