Target
6-phosphofructo-2-kinase/fructose-2,6-bisphosphatase 4
Ligand
BDBM267082
Substrate
Meas. Tech.
PFKFB4 Assay
IC50
800±n/a nM
Citation
 Martinsson, JFaernegardh, KJoensson, MRingom, R Bisarylsulfonamides useful in the treatment of inflammation and cancer US Patent  US9718809 Publication Date 8/1/2017 
Target
Name:
6-phosphofructo-2-kinase/fructose-2,6-bisphosphatase 4
Synonyms:
6-phosphofructo-2-kinase/fructose-2,6-bisphosphatase 4 (PFKFB4) PFKFB4
Type:
Enzyme
Mol. Mass.:
54039.68
Organism:
Homo sapiens (Human)
Description:
Q16877
Residue:
469
  
Inhibitor
Name:
BDBM267082
Synonyms:
3-[(5-Methylisoxazol-3-yl)amino]propyl 4-{[(5'-fluoro-2'-hydroxybiphenyl-3-yl)sulfonyl]amino}-2-hydroxybenzoate trifluoroacetate | US9718809, 232
Type:
Small organic molecule
Emp. Form.:
C26H24FN3O7S
Mol. Mass.:
541.548
SMILES:
Cc1cc(NCCCOC(=O)c2ccc(NS(=O)(=O)c3cccc(c3)-c3cc(F)ccc3O)cc2O)no1
: