Target
Estrogen receptor beta
Ligand
BDBM30862
Substrate
Meas. Tech.
Estrogen Receptor-beta Coactivator Binding Inhibitors ELISA Secondary Assay
IC50
23±n/a nM
Citation
 PubChem, PC Estrogen Receptor-beta Coactivator Binding Inhibitors ELISA Secondary Assay PubChem Bioassay (2008)[AID] 
Target
Name:
Estrogen receptor beta
Synonyms:
ER-beta ESR2_HUMAN Estradiol receptor beta (ERβ) Estrogen receptor (ER beta) Estrogen receptor beta (ER beta) NR3A2 estrogen beta
Type:
Protein
Mol. Mass.:
59238.43
Organism:
Homo sapiens (Human)
Description:
Q92731
Residue:
530
  
Inhibitor
Name:
BDBM30862
Synonyms:
1-allyl-2,5-diketo-dipyrido[1,2-d:3',4'-f]pyrimidine-3-carbonitrile 2,5-bis(oxidanylidene)-1-prop-2-enyl-dipyrido[1,2-d:3',4'-f]pyrimidine-3-carbonitrile 2,5-dioxo-1-prop-2-enyldipyrido[1,2-d:3',4'-f]pyrimidine-3-carbonitrile SMR000029848 | cid_3239161
Type:
Small organic molecule
Emp. Form.:
C15H10N4O2
Mol. Mass.:
278.2655
SMILES:
C=CCn1c2nc3ccccn3c(=O)c2cc(C#N)c1=O
: