Target
Estrogen receptor beta
Ligand
BDBM48413
Substrate
Meas. Tech.
Estrogen Receptor-beta Coactivator Binding Inhibitors ELISA Secondary Assay
IC50
23±n/a nM
Citation
 PubChem, PC Estrogen Receptor-beta Coactivator Binding Inhibitors ELISA Secondary Assay PubChem Bioassay (2008)[AID] 
Target
Name:
Estrogen receptor beta
Synonyms:
ER-beta ESR2_HUMAN Estradiol receptor beta (ERβ) Estrogen receptor (ER beta) Estrogen receptor beta (ER beta) NR3A2 estrogen beta
Type:
Protein
Mol. Mass.:
59238.43
Organism:
Homo sapiens (Human)
Description:
Q92731
Residue:
530
  
Inhibitor
Name:
BDBM48413
Synonyms:
1-[5-(tosylmethyl)-2-furoyl]nipecotic acid ethyl ester MLS000117524 cid_5307414 ethyl 1-[5-[(4-methylphenyl)sulfonylmethyl]furan-2-yl]carbonylpiperidine-3-carboxylate
Type:
Small organic molecule
Emp. Form.:
C21H25NO6S
Mol. Mass.:
419.491
SMILES:
CCOC(=O)C1CCCN(C1)C(=O)c1ccc(CS(=O)(=O)c2ccc(C)cc2)o1
: