Target
Estrogen receptor beta
Ligand
BDBM34511
Substrate
Meas. Tech.
Estrogen Receptor-beta Coactivator Binding Inhibitors ELISA Secondary Assay
IC50
23±n/a nM
Citation
 PubChem, PC Estrogen Receptor-beta Coactivator Binding Inhibitors ELISA Secondary Assay PubChem Bioassay (2008)[AID] 
Target
Name:
Estrogen receptor beta
Synonyms:
ER-beta ESR2_HUMAN Estradiol receptor beta (ERβ) Estrogen receptor (ER beta) Estrogen receptor beta (ER beta) NR3A2 estrogen beta
Type:
Protein
Mol. Mass.:
59238.43
Organism:
Homo sapiens (Human)
Description:
Q92731
Residue:
530
  
Inhibitor
Name:
BDBM34511
Synonyms:
6-(2,3-dihydro-1,4-benzodioxin-3-yl)-3-(phenoxymethyl)-[1,2,4]triazolo[3,4-b][1,3,4]thiadiazole SMR000092771 | cid_4416981
Type:
Small organic molecule
Emp. Form.:
C18H14N4O3S
Mol. Mass.:
366.394
SMILES:
C(Oc1ccccc1)c1nnc2sc(nn12)C1COc2ccccc2O1
: