Target
Transcription factor p65
Ligand
BDBM49216
Substrate
Meas. Tech.
Name: High Throughput Screen to Identify Compounds that increase expression of NF-kB in Human Neuronal Cells - Dose Response
EC50
389±n/a nM
Citation
 PubChem, PC Name: High Throughput Screen to Identify Compounds that increase expression of NF-kB in Human Neuronal Cells - Dose Response PubChem Bioassay (2008)[AID] 
Target
Name:
Transcription factor p65
Synonyms:
NFKB3 Nuclear factor NF-kappa-B p65 subunit TF65_HUMAN | v-rel reticuloendotheliosis viral oncogene homolog A isoform 1
Type:
Enzyme
Mol. Mass.:
60211.92
Organism:
Homo sapiens (Human)
Description:
Q04206
Residue:
551
  
Inhibitor
Name:
BDBM49216
Synonyms:
MLS000097869 N-(6-methyl-1,3-benzothiazol-2-yl)thiophene-2-carboxamide cid_739615
Type:
Small organic molecule
Emp. Form.:
C13H10N2OS2
Mol. Mass.:
274.361
SMILES:
Cc1ccc2nc(NC(=O)c3cccs3)sc2c1
: