Target
Induced myeloid leukemia cell differentiation protein Mcl-1
Ligand
BDBM34336
Substrate
Meas. Tech.
Dose Response Confirmation for Mcl-1/Noxa Interaction Inhibitors
IC50
400±n/a nM
Citation
 PubChem, PC Dose Response Confirmation for Mcl-1/Noxa Interaction Inhibitors PubChem Bioassay (2008)[AID] 
Target
Name:
Induced myeloid leukemia cell differentiation protein Mcl-1
Synonyms:
BCL2L3 Bcl-2-like protein 3 (Mcl-1) Bcl2-L-3 MCL1 Mcl-1 Myeloid cell leukemia sequence 1 (BCL2-related) | mcl1/EAT
Type:
Membrane; Single-pass membrane protein
Mol. Mass.:
37332.87
Organism:
Homo sapiens (Human)
Description:
Q07820
Residue:
350
  
Inhibitor
Name:
BDBM34336
Synonyms:
2-(2-morpholin-4-yl-5-morpholin-4-ylsulfonyl-phenyl)-1,2-benzothiazol-3-one 2-(2-morpholino-5-morpholinosulfonyl-phenyl)-1,2-benzothiazol-3-one MLS000055722 cid_2325815
Type:
Small organic molecule
Emp. Form.:
C21H23N3O5S2
Mol. Mass.:
461.554
SMILES:
O=c1n(sc2ccccc12)-c1cc(ccc1N1CCOCC1)S(=O)(=O)N1CCOCC1
: