Target
Induced myeloid leukemia cell differentiation protein Mcl-1
Ligand
BDBM33065
Substrate
Meas. Tech.
Dose Response Confirmation for Mcl-1/Noxa Interaction Inhibitors
IC50
1456.30229±n/a nM
Citation
 PubChem, PC Dose Response Confirmation for Mcl-1/Noxa Interaction Inhibitors PubChem Bioassay (2008)[AID] 
Target
Name:
Induced myeloid leukemia cell differentiation protein Mcl-1
Synonyms:
BCL2L3 Bcl-2-like protein 3 (Mcl-1) Bcl2-L-3 MCL1 Mcl-1 Myeloid cell leukemia sequence 1 (BCL2-related) | mcl1/EAT
Type:
Membrane; Single-pass membrane protein
Mol. Mass.:
37332.87
Organism:
Homo sapiens (Human)
Description:
Q07820
Residue:
350
  
Inhibitor
Name:
BDBM33065
Synonyms:
1-[[2,3-bis(2-furyl)quinoxalin-6-yl]carbamoyl]isonipecotic acid ethyl ester MLS000113285 cid_2925160 | ethyl 1-[[2,3-bis(furan-2-yl)quinoxalin-6-yl]carbamoyl]piperidine-4-carboxylate
Type:
Small organic molecule
Emp. Form.:
C25H24N4O5
Mol. Mass.:
460.4819
SMILES:
CCOC(=O)C1CCN(CC1)C(=O)Nc1ccc2nc(-c3ccco3)c(nc2c1)-c1ccco1
: