Target
Induced myeloid leukemia cell differentiation protein Mcl-1
Ligand
BDBM44482
Substrate
Meas. Tech.
Dose Response Confirmation for Mcl-1/Noxa Interaction Inhibitors
IC50
54000±n/a nM
Citation
 PubChem, PC Dose Response Confirmation for Mcl-1/Noxa Interaction Inhibitors PubChem Bioassay (2008)[AID] 
Target
Name:
Induced myeloid leukemia cell differentiation protein Mcl-1
Synonyms:
BCL2L3 Bcl-2-like protein 3 (Mcl-1) Bcl2-L-3 MCL1 Mcl-1 Myeloid cell leukemia sequence 1 (BCL2-related) | mcl1/EAT
Type:
Membrane; Single-pass membrane protein
Mol. Mass.:
37332.87
Organism:
Homo sapiens (Human)
Description:
Q07820
Residue:
350
  
Inhibitor
Name:
BDBM44482
Synonyms:
2-[(5Z)-5-[(E)-3-(2-furanyl)prop-2-enylidene]-4-oxo-2-sulfanylidene-3-thiazolidinyl]-3-methylbutanoic acid 2-[(5Z)-5-[(E)-3-(furan-2-yl)prop-2-enylidene]-4-oxidanylidene-2-sulfanylidene-1,3-thiazolidin-3-yl]-3-methyl-butanoic acid 2-{5-[(E)-3-Furan-2-yl-prop-2-en-(Z)-ylidene]-4-oxo-2-thioxo-thiazolidin-3-yl}-3-methyl-butyric acid SMR000145597 | cid_6393068
Type:
Small organic molecule
Emp. Form.:
C15H15NO4S2
Mol. Mass.:
337.414
SMILES:
CC(C)C(N1C(=S)S\C(=C/C=C/c2ccco2)C1=O)C(O)=O
: