Target
Induced myeloid leukemia cell differentiation protein Mcl-1
Ligand
BDBM41039
Substrate
Meas. Tech.
Dose Response Confirmation for Mcl-1/Noxa Interaction Inhibitors
IC50
400±n/a nM
Citation
 PubChem, PC Dose Response Confirmation for Mcl-1/Noxa Interaction Inhibitors PubChem Bioassay (2008)[AID] 
Target
Name:
Induced myeloid leukemia cell differentiation protein Mcl-1
Synonyms:
BCL2L3 Bcl-2-like protein 3 (Mcl-1) Bcl2-L-3 MCL1 Mcl-1 Myeloid cell leukemia sequence 1 (BCL2-related) | mcl1/EAT
Type:
Membrane; Single-pass membrane protein
Mol. Mass.:
37332.87
Organism:
Homo sapiens (Human)
Description:
Q07820
Residue:
350
  
Inhibitor
Name:
BDBM41039
Synonyms:
MLS000324487 [3-amino-6-(4-methoxyphenyl)-2-thieno[2,3-b]pyridinyl]-(3,4-dimethoxyphenyl)methanone [3-amino-6-(4-methoxyphenyl)thieno[2,3-b]pyridin-2-yl]-(3,4-dimethoxyphenyl)methanone cid_1004085
Type:
Small organic molecule
Emp. Form.:
C23H20N2O4S
Mol. Mass.:
420.481
SMILES:
COc1ccc(cc1)-c1ccc2c(N)c(sc2n1)C(=O)c1ccc(OC)c(OC)c1
: