Target
Induced myeloid leukemia cell differentiation protein Mcl-1
Ligand
BDBM46918
Substrate
Meas. Tech.
Dose Response Confirmation for Mcl-1/Noxa Interaction Inhibitors
IC50
400±n/a nM
Citation
 PubChem, PC Dose Response Confirmation for Mcl-1/Noxa Interaction Inhibitors PubChem Bioassay (2008)[AID] 
Target
Name:
Induced myeloid leukemia cell differentiation protein Mcl-1
Synonyms:
BCL2L3 Bcl-2-like protein 3 (Mcl-1) Bcl2-L-3 MCL1 Mcl-1 Myeloid cell leukemia sequence 1 (BCL2-related) | mcl1/EAT
Type:
Membrane; Single-pass membrane protein
Mol. Mass.:
37332.87
Organism:
Homo sapiens (Human)
Description:
Q07820
Residue:
350
  
Inhibitor
Name:
BDBM46918
Synonyms:
4-(2-Ethyl-piperidine-1-sulfonyl)-N-pyridin-2-ylmethyl-N-(tetrahydro-furan-2-ylmethyl)-benzenesulfonamide 4-(2-ethylpiperidino)sulfonyl-N-(2-pyridylmethyl)-N-(tetrahydrofurfuryl)benzenesulfonamide MLS000553510 cid_3189908
Type:
Small organic molecule
Emp. Form.:
C24H33N3O5S2
Mol. Mass.:
507.666
SMILES:
CCC1CCCCN1S(=O)(=O)c1ccc(cc1)S(=O)(=O)N(CC1CCCO1)Cc1ccccn1
: