Target
Induced myeloid leukemia cell differentiation protein Mcl-1
Ligand
BDBM46190
Substrate
Meas. Tech.
Dose Response Confirmation for Mcl-1/Noxa Interaction Inhibitors
IC50
578.778357±n/a nM
Citation
 PubChem, PC Dose Response Confirmation for Mcl-1/Noxa Interaction Inhibitors PubChem Bioassay (2008)[AID] 
Target
Name:
Induced myeloid leukemia cell differentiation protein Mcl-1
Synonyms:
BCL2L3 Bcl-2-like protein 3 (Mcl-1) Bcl2-L-3 MCL1 Mcl-1 Myeloid cell leukemia sequence 1 (BCL2-related) | mcl1/EAT
Type:
Membrane; Single-pass membrane protein
Mol. Mass.:
37332.87
Organism:
Homo sapiens (Human)
Description:
Q07820
Residue:
350
  
Inhibitor
Name:
BDBM46190
Synonyms:
1-[2,3-bis(2-furanyl)-6-quinoxalinyl]-3-(2-hydroxyethyl)urea 1-[2,3-bis(furan-2-yl)quinoxalin-6-yl]-3-(2-hydroxyethyl)urea cid_3157646
Type:
Small organic molecule
Emp. Form.:
C19H16N4O4
Mol. Mass.:
364.3547
SMILES:
OCCNC(=O)Nc1ccc2nc(-c3ccco3)c(nc2c1)-c1ccco1
: