Target
Glycoprotein 42
Ligand
BDBM46810
Substrate
Meas. Tech.
Dose Response Confirmation for Small Molecule Inhibitors of Epstein-Barr Virus
IC50
1100±n/a nM
Citation
 PubChem, PC Dose Response Confirmation for Small Molecule Inhibitors of Epstein-Barr Virus PubChem Bioassay (2008)[AID] 
Target
Name:
Glycoprotein 42
Synonyms:
BZLF2 | GP42_EBVA8
Type:
Enzyme Catalytic Domain
Mol. Mass.:
25424.12
Organism:
Human herpesvirus 4 type 2
Description:
gi_139424501
Residue:
223
  
Inhibitor
Name:
BDBM46810
Synonyms:
8-Amino-7-methyl-3-phenethyl-10H-benzo[g]pteridine-2,4-dione 8-amino-7-methyl-3-phenethyl-1H-benzo[g]pteridine-2,4-quinone MLS000332303 cid_5422858
Type:
Small organic molecule
Emp. Form.:
C19H17N5O2
Mol. Mass.:
347.3706
SMILES:
Cc1cc2nc3c(nc2cc1N)[nH]c(=O)n(CCc1ccccc1)c3=O
: