Target
DNA repair protein RAD51 homolog 1
Ligand
BDBM29673
Substrate
Meas. Tech.
Homologous Recombination_Rad51_DNA binding assay
IC50
85000±n/a nM
Citation
 PubChem, PC Homologous Recombination_Rad51_DNA binding assay PubChem Bioassay (2008)[AID] 
Target
Name:
DNA repair protein RAD51 homolog 1
Synonyms:
RAD51 RAD51_HUMAN | RECA
Type:
Enzyme Catalytic Domain
Mol. Mass.:
36960.74
Organism:
Homo sapiens (Human)
Description:
gi_49168602
Residue:
339
  
Inhibitor
Name:
BDBM29673
Synonyms:
1,4,10-Trihydroxy-5-hydroxymethyl-8-methyl-3,7-dioxo-1,3-dihydro-7H-benzo[e]furo[3'''',4'''':3,4]benzo[b][1,4]dioxepine-11-carbaldehyde NSC-87509 cid_5320418
Type:
Small organic molecule
Emp. Form.:
C18H12O10
Mol. Mass.:
388.2819
SMILES:
Cc1cc(O)c(C=O)c2Oc3c4C(O)OC(=O)c4c(O)c(CO)c3OC(=O)c12
: