Target
DNA repair protein RAD51 homolog 1
Ligand
BDBM51317
Substrate
Meas. Tech.
Homologous Recombination_Rad51_DNA binding assay
IC50
85000±n/a nM
Citation
 PubChem, PC Homologous Recombination_Rad51_DNA binding assay PubChem Bioassay (2008)[AID] 
Target
Name:
DNA repair protein RAD51 homolog 1
Synonyms:
RAD51 RAD51_HUMAN | RECA
Type:
Enzyme Catalytic Domain
Mol. Mass.:
36960.74
Organism:
Homo sapiens (Human)
Description:
gi_49168602
Residue:
339
  
Inhibitor
Name:
BDBM51317
Synonyms:
1,6-dimethylnaphtho[1,2-g][1]benzofuran-10,11-dione 1,6-dimethylnaphtho[1,2-g]benzofuran-10,11-quinone SMR000445578 acs.jmedchem.1c00409_ST.675 | cid_114917
Type:
Small organic molecule
Emp. Form.:
C18H12O3
Mol. Mass.:
276.2861
SMILES:
Cc1coc-2c1C(=O)C(=O)c1c-2ccc2c(C)cccc12
: