Target
DNA repair protein RAD51 homolog 1
Ligand
BDBM51332
Substrate
Meas. Tech.
Homologous recombination_Rad 51_dose response_2
IC50
53000±n/a nM
Citation
 PubChem, PC Homologous recombination_Rad 51_dose response_2 PubChem Bioassay (2008)[AID] 
Target
Name:
DNA repair protein RAD51 homolog 1
Synonyms:
RAD51 RAD51_HUMAN | RECA
Type:
Enzyme Catalytic Domain
Mol. Mass.:
36960.74
Organism:
Homo sapiens (Human)
Description:
gi_49168602
Residue:
339
  
Inhibitor
Name:
BDBM51332
Synonyms:
MLS000684942 SMR000324900 | cid_16189239
Type:
Small organic molecule
Emp. Form.:
C23H30N4O4S2
Mol. Mass.:
490.639
SMILES:
COc1ccc(C)c2sc(nc12)N(CCCN(C)C)C(=O)c1ccc(cc1)S(=O)(=O)N(C)C
: