Target
DNA repair protein RAD51 homolog 1
Ligand
BDBM51360
Substrate
Meas. Tech.
Homologous recombination_Rad 51_dose response_2
IC50
53000±n/a nM
Citation
 PubChem, PC Homologous recombination_Rad 51_dose response_2 PubChem Bioassay (2008)[AID] 
Target
Name:
DNA repair protein RAD51 homolog 1
Synonyms:
RAD51 RAD51_HUMAN | RECA
Type:
Enzyme Catalytic Domain
Mol. Mass.:
36960.74
Organism:
Homo sapiens (Human)
Description:
gi_49168602
Residue:
339
  
Inhibitor
Name:
BDBM51360
Synonyms:
5-chloranyl-1,3-dimethyl-N-[2-oxidanylidene-2-[(phenylmethyl)amino]ethyl]pyrazole-4-carboxamide MLS000763400 N-[2-(benzylamino)-2-oxoethyl]-5-chloro-1,3-dimethyl-1H-pyrazole-4-carboxamide SMR000336268 | cid_4421157
Type:
Small organic molecule
Emp. Form.:
C15H17ClN4O2
Mol. Mass.:
320.774
SMILES:
Cc1nn(C)c(Cl)c1C(=O)NCC(=O)NCc1ccccc1
: