Target
DNA repair protein RAD51 homolog 1
Ligand
BDBM51363
Substrate
Meas. Tech.
Homologous recombination_Rad 51_dose response_2
IC50
53000±n/a nM
Citation
 PubChem, PC Homologous recombination_Rad 51_dose response_2 PubChem Bioassay (2008)[AID] 
Target
Name:
DNA repair protein RAD51 homolog 1
Synonyms:
RAD51 RAD51_HUMAN | RECA
Type:
Enzyme Catalytic Domain
Mol. Mass.:
36960.74
Organism:
Homo sapiens (Human)
Description:
gi_49168602
Residue:
339
  
Inhibitor
Name:
BDBM51363
Synonyms:
1-(4-chlorophenyl)-2-[(5-methyl-1,3,4-thiadiazol-2-yl)sulfanyl]ethanone MLS000723830 cid_686457
Type:
Small organic molecule
Emp. Form.:
C11H9ClN2OS2
Mol. Mass.:
284.785
SMILES:
Cc1nnc(SCC(=O)c2ccc(Cl)cc2)s1
: